{"text_format":"2","workbook":"xlsx","n_sheets":4,"sheets":["OGRID Lookup","Summary by OGRID","Lookup New","Reassigned"],"not_rendered":{"charts":0,"images":0,"macros":0,"external_links":0,"defined_names":5,"comments":0,"pivot_tables":0},"unopened":[],"bounds":{"document_bytes":16777216,"sheet_cells":100000,"run_cost":"one","rows_first":2000,"rows_last":500,"rows_between":2000,"halvings":0,"cell_chars":16384,"cell_head_chars":4096},"cells_cut":0,"cells_raw":0,"read":"whole","date_system":"1900"}

{"sheet":"OGRID Lookup","index":0,"n_rows":5,"n_cols":6,"rows_kept":5,"cut":false,"hidden":false,"merged":[]}
[]
[]
[null,"To utilize this tool type in OGRID and hit Enter"]
[null,"OGRID","Company","Analyst","Email","Phone"]
[null,null,{"$f":"+IF(B5=\"\",\"<---- Type in OGRID\",VLOOKUP($B$5,Reassigned!$A:$E,2,FALSE))","v":"<---- Type in OGRID"},{"$f":"+IF(B5=\"\",\"\",IFERROR(VLOOKUP($B$5,Reassigned!$A:$E,3,FALSE),\"Dilia\"))","v":""},{"$f":"+IF(B5=\"\",\"\",IFERROR(VLOOKUP($B$5,Reassigned!$A:$E,4,FALSE),\"dborunda@nmslo.gov\"))","v":""},{"$f":"+IF(B5=\"\",\"\",IFERROR(VLOOKUP($B$5,Reassigned!$A:$E,5,FALSE),\"(505) 827-5738\"))","v":""}]

{"sheet":"Summary by OGRID","index":1,"n_rows":158,"n_cols":9,"rows_kept":158,"cut":false,"hidden":false,"merged":[[101,0,118,0],[101,1,101,6],[119,0,134,0],[119,1,119,6],[135,0,158,0],[135,1,135,6],[73,0,100,0],[73,1,73,6],[1,0,1,6],[3,0,30,0],[3,1,3,6],[31,0,72,0],[31,1,31,6]]}
["RMD REVENUE PROCESSING BUREAU",{"$nulls":4},"OGRID ASSIGNMENTS AS OF ","2025-02-20"]
["All OGRIDs are assigned in 2 primary blocks (From 785-215000 and 215001-End) and are assigned to 2 analysts;\nhowever OGRIDs within an assigned block which submit more complex returns are reassigned to advanced analyst positions."]
[]
["BLOCK 1- OGRIDs 785 - 215000 (except as noted)","ANALYST:  STEPHANIE"]
[]
[null,"DOES NOT PROCESS:",null,"ASSIGNED TO:","DOES NOT PROCESS:",null,"ASSIGNED TO:"]
[null,785,"AMTEX ENERGY INC                             ","Estevan A",19958,"STEPHENS & JOHNSON OP CO                     ","Estevan A"]
[null,873,"APACHE CORPORATION                           ","Klarisa",20305,"DEVON SFS OPERATING INC","Sammie"]
[null,1092,"ARMSTRONG ENERGY CORP                        ","Estevan A",21355,"SOUTHWEST ROYALTIES INC                      ","Klarisa"]
[null,3002,"BTA OIL PRODUCERS                  ","Sammie",21712,"STRATA PRODUCTION CO                         ","Estevan A"]
[null,4323,"CHEVRON U S A INC                            ","Mallory",25575,"EOG Y RESOURCES INC","Sammie"]
[null,4378,"CHI OPERATING INC                            ","Sammie",32954,"MARATHON OIL CO - OIL","Mallory"]
[null,4537,"CITATION OIL & GAS CORP                      ","Estevan A",33479,"HOLLYFRONTIER REFINING & MARKETING LLC       ","Klarisa"]
[null,"5380*","XTO ENERGY, INC*                             ","Casandra",33719,"OXY USA - GAS OPR & PUR","Mallory",null,"*Casandra to process until all account is cleared up"]
[null,6137,"DEVON ENERGY PRODUCTION COMPANY, LP          ","Sammie",33726,"OXY USA INC - OIL","Mallory"]
[null,6515,"DUGAN PRODUCTION CORP                        ","Sammie",34053,"PLAINS MARKETING L.P.                        ","Klarisa"]
[null,7377,"EOG RESOURCES INC                            ","Sammie",35246,"SHELL TRADING US COMPANY                     ","Mallory"]
[null,10155,"HARVARD PETROLEUM COMPANY, LLC               ","Estevan A",138008,"SPECIAL ENERGY CORP                          ","Klarisa"]
[null,12361,"KAISER-FRANCIS OIL CO                        ","Sammie",151323,"PRIDE ENERGY COMPANY                         ","Estevan A"]
[null,13089,"LARIO OIL & GAS CO                           ","Estevan A",151416,"FASKEN OIL & RANCH LTD                       ","Estevan A"]
[null,13837,"MACK ENERGY CORP                             ","Klarisa",157984,"OCCIDENTAL PERMIAN LTD                       ","Mallory"]
[null,14021,"MARATHON OIL CO","Mallory",159617,"OCCIDENTAL PERMIAN LTD.","Mallory"]
[null,14187,"MARSHALL & WINSTON INC                       ","Estevan A",162683,"CIMAREX ENERGY CO. OF COLORADO               ","Sammie"]
[null,14462,"ME-TEX OIL & GAS INC                         ","Estevan A",166111,"DEVON ENERGY PRODUCTION CO. LP","Sammie"]
[null,14634,"MERRION OIL & GAS CORP                       ","Estevan A",169355,"DEVON LOUISIANA CORPORATION","Sammie"]
[null,14744,"MEWBOURNE OIL CO                             ","Mallory",173413,"E G L RESOURCES INC                          ","Estevan A"]
[null,15363,"Murchison Oil and Gas, LLC                   ","Estevan",174238,"ENTERPRISE CRUDE OIL LLC                     ","Estevan A"]
[null,16696,"OXY USA INC                                  ","Mallory",192463,"OXY USA WTP LIMITED PARTNERSHIP              ","Mallory"]
[null,17213,"PENROC OIL CORP                              ","Estevan A",194188,"OXY USA WTP LIMITED PARTNERSHIP(OIL)              ","Mallory"]
[null,19111,"RHOMBUS OPERATING CO LTD                     ","Estevan A"]
[]
["BLOCK 2-ALL OGRIDs 215001 - END (except as noted)","ANALYST:  MONIQUE"]
[]
[null,"DOES NOT PROCESS:",null,"ASSIGNED TO:","DOES NOT PROCESS:",null,"ASSIGNED TO:"]
[null,216304,"CHEVRON USA-GT                               ","Mallory",330423,"Extex Operating Company                      ","Estevan A"]
[null,217817,"CONOCOPHILLIPS COMPANY                       ","Mallory",330447,"Contango Resources, LLC                      ","Sammie"]
[null,217955,"COG PRODUCTION, LLC","Mallory",330506,"MR NM Operating LLC                          ","Sammie"]
[null,221312,"TRI-STAR PRODUCER SERVICES OF TX LP          ","Klarisa",330679,"Empire New Mexico LLC                        ","Sammie"]
[null,227718,"MATADOR RESOURCES COMPANY                    ","Klarisa",330782,"SCO PERMIAN, LLC                             ","Estevan A"]
[null,228051,"AMERICO ENERGY RESOURCES LLC                 ","Estevan A",330887,"Opal Operating Company LLC                   ","Klarisa"]
[null,229137,"COG OPERATING LLC                            ","Mallory ",330949,"SCOUT ENERGY MANAGEMENT LLC                  ","Estevan A"]
[null,231429,"MANZANO LLC                                  ","Estevan A",330968,"Silverback Operating II, LLC                 ","Klarisa"]
[null,232006,"OCCIDENTAL ENERGY M CORP                     ","Mallory ",331054,"Marlin Operating, LLC                        ","Klarisa"]
[null,232611,"SUNDOWN ENERGY LP                            ","Estevan A",331165,"Earthstone Operating, LLC                   ","Mallory"]
[null,241333,"CHEVRON MIDCONTINENT, L.P.                   ","Mallory ",331199,"Maverick Permian LLC                         ","Sammie"]
[null,246289,"WPX Energy Permian, LLC                      ","Estevan A",331417,"Atlas Opaerating LLC","Estevan A"]
[null,249099,"CAZA OPERATING, LLC                          ","Estevan A",331569,"3R Operating, LLC                            ","Estevan A"]
[null,251346,"DORADO TRANSPORTATION, LLC                   ","Estevan A",331595,"Franklin Mountain Energy 3, LLC              ","Klarisa"]
[null,256073,"J R OIL, LTD. CO.                            ","Estevan A",332148,"TEAM OPERATING, L.L.C.                       ","Estevan A"]
[null,256512,"CML EXPLORATION, LLC                         ","Estevan A",332195,"Civitas Permian Operating, LLC               ","Klarisa"]
[null,260297,"BTA OIL PRODUCERS, LLC                       ","Sammie",341104,"CIVITAS RESOURCES, INC","Klarisa"]
[null,288243,"PHILLIPS 66 COMPANY                          ","Sammie",370080,"BREITBURN OPERATING LP                       ","Estevan A"]
[null,289408,"LOGOS OPERATING, LLC                         ","Estevan A",370474,"RIO ENERGY INTERNATIONAL, INC.               ","Klarisa"]
[null,298299,"CROSS TIMBERS ENERGY, LLC                    ","Sammie",370740,"FOUNDATION ENERGY MANAGEMENT, LLC            ","Estevan A"]
[null,311845,"ONSHORE ROYALTIES, LLC                       ","Klarisa",371416,"FORTY ACRES ENERGY, LLC                      ","Klarisa"]
[null,315528,"MRC DELAWARE RESOURCE, LLC                   ","Estevan A",371449,"COLGATE OPERATING, LLC                       ","Sammie"]
[null,327738,"COERT HOLDINGS 1, LLC.                       ","Estevan A",371682,"STEWARD ENERGY II, LLC                       ","Klarisa"]
[null,328565,"BAM Permian Operating, LLC                   ","Estevan A",371838,"DJR OPERATING, LLC                           ","Sammie"]
[null,328947,"Spur Energy Partners LLC                     ","Klarisa",372043,"TAP ROCK OPERATING, LLC                      ","Klarisa"]
[null,328992,"Sabinal Energy Operating, LLC                ","Estevan A",372098,"MARATHON OIL PERMIAN LLC                     ","Mallory"]
[null,329319,"LH Operating, LLC                            ","Estevan A",372165,"Permian Resources Operating, LLC             ","Sammie"]
[null,329326,"FAE II Operating LLC                         ","Estevan A",372171,"HILCORP ENERGY COMPANY                       ","Klarisa"]
[null,329399,"North Fork Operating, LP                     ","Estevan A",372210,"LONGFELLOW ENERGY, LP                        ","Klarisa"]
[null,329487,"BXP Operating, LLC                           ","Estevan A",372224,"AMEREDEV OPERATING, LLC                      ","Sammie"]
[null,329691,"United Energy Trading LLC                    ","Estevan A",372241,"QUATRO OSOS E&P, LLC                         ","Estevan A"]
[null,329736,"SIMCOE LLC                                   ","Klarisa",372286,"ENDURING RESOURCES, LLC                      ","Estevan A"]
[null,329748,"Tascosa Energy Partners, L.L.C               ","Klarisa",372290,"RILEY PERMIAN OPERATING COMPANY, LLC         ","Estevan A"]
[null,329877,"IACX Production LLC                          ","Klarisa",372834,"EPIC ENERGY, L.L.C.                          ","Sammie"]
[null,330132,"MorningStar Operating LLC                    ","Sammie",373671,"Unitex Oil & Gas, L.L.C.                     ","Estevan A"]
[null,330220,"RAYBAW Operating, LLC                        ","Estevan A",373908,"Franklin Mountain Energy 2 LLC                 ","Klarisa"]
[null,330238,"Solis Partners, L.L.C.                       ","Klarisa",373910,"Franklin Mountain Energy LLC                 ","Klarisa"]
[null,330396,"Avant Operating, LLC                         ","Estevan A",374034,"Flat Creek Resources, LLC                    ","Estevan A"]
[]
["ASSIGNED REMITTERS ","ANALYST: ESTEVAN A"]
[null,"REASSIGNED OGRIDs IN:",null,"ASSIGNED FROM:","REASSIGNED OGRIDs IN:",null,"ASSIGNED FROM:"]
[null,785,"AMTEX ENERGY INC                             ","Stephanie",289408,"LOGOS OPERATING, LLC                         ","Monique"]
[null,1092,"ARMSTRONG ENERGY CORP                        ","Stephanie",315528,"MRC DELAWARE RESOURCE, LLC                   ","Monique"]
[null,4537,"CITATION OIL & GAS CORP                      ","Stephanie",327738,"COERT HOLDINGS 1, LLC.                       ","Monique"]
[null,10155,"HARVARD PETROLEUM COMPANY, LLC               ","Stephanie",328565,"BAM Permian Operating, LLC                   ","Monique"]
[null,13089,"LARIO OIL & GAS CO                           ","Stephanie",328992,"Sabinal Energy Operating, LLC                ","Monique"]
{"$rows_left_out":79}
{"sheet":"Lookup New","index":2,"n_rows":378,"n_cols":6,"rows_kept":378,"cut":false,"hidden":true,"merged":[]}
["OGRID","Ogrid Name","Name","Phone Number","Email","Analyst"]
[184,"ACOMA OIL CORP","Charli Rust","817-732-9383","rustoilcorp@gmail.com","Stephanie"]
[778,"BP AMERICA PRODUCTION COMPANY","Ralph Charles","281-810-3895","Ralph.charles@bpx.com","Stephanie"]
[785,"AMTEX ENERGY INC","Sarah Wilson","817-720-5225","swilson@amtexenergy.com","Estevan A"]
[873,"APACHE CORPORATION","Dee Davis","713-296-7382","dee.davis@apachecorp.com","Klarisa"]
[1092,"ARMSTRONG ENERGY CORP","Brittani Rovedo","575-625-2222 Ext 334","brovedo@aecnm.com","Estevan A"]
[1801,"BEPCO, LP","Agostina Soriano",200147451,"maria.a.soriano@exxonmobil.com","Stephanie"]
[1903,"BEACH EXPLORATION INC","Brenda Martin","432-683-6226","bmartin@beachexp.com","Stephanie"]
[2096,"BENSON-MONTIN-GREER DRILLING CORP","Matt Dimond","(505)325-8874","mrd@bmgdrilling.com","Stephanie"]
[2175,"BETTIS BOYLE & STOVALL,INC.","Deborah Todd","940-549-0780, X128","dl.todd@sbcglobal.net","Stephanie"]
[2193,"BETWELL OIL & GAS CO","Kathy Rangel","305-821-8300","kathyr@dunncos.com","Stephanie"]
[2799,"BRECK OPERATING CORP","Linda Venekamp","(254) 559-3355 X 260","lvenekamp@breckop.com","Stephanie"]
[2832,"BRIDWELL OIL CO","Kimberly Huston","940-723-4351","khuston@bridwelloil.com","Stephanie"]
[3002,"BTA OIL PRODUCERS","Stephani Knight","432-682-3753","sknight@btaoil.com","Sammie"]
[3044,"BURGUNDY OIL & GAS OF N M INC","Elizabeth Peterson","(432) 684-4033 204","epeterson.bogi@att.net","Stephanie"]
[4323,"CHEVRON U S A INC","Jeanne Darmosuwito","713-754-3676","FSSTAXROYMail@chevron.com","Mallory"]
[4378,"CHI OPERATING INC","Dana Welch","(432) 685-5001","danaw@chienergyinc.com","Sammie"]
[4537,"CITATION OIL & GAS CORP","Stephanie Soto","(281) 891-1336","ssoto@cogc.com","Estevan A"]
[5380,"XTO ENERGY, INC","Yanina Eliana Aguilar","200-146-335","YANINA.E.AGUILAR@EXXONMOBIL.COM","Casandra"]
[5493,"CURTIS J LITTLE","SUSAN LITTLE","505-327-6176","sllittle@littleoilandgas.com","Stephanie"]
[5898,"DAVID H ARRINGTON OIL & GAS INC","Kathy Krell","817-994-0273","kathy.krell@arringtonoil.com","Stephanie"]
[6137,"DEVON ENERGY PRODUCTION COMPANY, LP","Bill Ries",4055526531,"Bill.Ries@dvn.com","Sammie"]
[6224,"DINERO OPERATING CO","Teresa Hansen","432-684-5544","teresa@dineroinc.com","Stephanie"]
[6515,"DUGAN PRODUCTION CORP","Lynn Collier","(505) 325-1821","lynn.collier@duganproduction.com","Sammie"]
[6742,"ECHO PRODUCTION INC","Melodee Guerrero","940-549-3292 ext. 113","melodee@echoproduction.com","Stephanie"]
[7160,"ELLIOTT A RIGGS","Terri Kennedy","928-460-5287","Officemanager@Riggsog.com","Stephanie"]
[7377,"EOG RESOURCES INC","Anh Pham","(832) 366-8442","anh_pham@eogresources.com","Sammie"]
[7802,"FEAGAN GATHERING CO","Marissa Villanueva","432-683-8442","marissav@feagangc.com","Stephanie"]
[8359,"GP II ENERGY INC","Ginny McCarty","(432) 425-2888","ginny@gp2energy.com","Stephanie"]
[9338,"GREAT WESTERN DRILLING CO","Kim Foster","(432) 682-5241","kfoster@gwdc.com","Stephanie"]
[9667,"H K KEESEE AND C J KEESEE TRUST","Lynn Collier","(505) 325-1821 ext. 1035","lynn.collier@duganproduction.com","Stephanie"]
[9812,"HEC PETROLEUM, INC","Jeanne Darmosuwito","713-754-3676","FSSTAXROYMail@chevron.com","Stephanie"]
[9974,"HANSON OPERATING CO INC","Carol Smith","575-622-7330 X26","carol@hansonop.com","Stephanie"]
[10155,"HARVARD PETROLEUM COMPANY, LLC","Gwen Burke","505-249-5654","gburke@hpcnm.com","Estevan A"]
[10605,"HOLCOMB OIL & GAS INC","Teresa McCown","505-326-0550","holcomb.oilgas@gmail.com","Stephanie"]
[11095,"J & J SERVICE INC","KALA CADDELL","(602) 859-5252","jjserviceinc@gmail.com","Stephanie"]
[12254,"JPH OIL PRODUCERS DBA JIMMY P HODGE","Ginger Ivie","575-390-6796","gingerivie@hotmail.com","Stephanie"]
[12361,"KAISER-FRANCIS OIL CO","Savanah Gibson","(918) 491-4265","savanahg@kfoc.net","Sammie"]
[12444,"PROVIDENCE ENERGY SERVS INC.-KELTON OP CORP","Dale Kelton","(432) 661-1364","providenceesi.info@gmail.com","Stephanie"]
[12627,"KEVIN O BUTLER & ASSOC INC","MAYRA SAENZ","(432) 682-1178","MAYRA.SAENZ@kobutler.com","Stephanie"]
[13089,"LARIO OIL & GAS CO","MINDY JEFFRIES","(316) 789-7823","mjeffries@lariooil.com","Estevan A"]
[13343,"LINDENMUTH & ASSOCIATES INC","Katie Toth","512-322-9779 ext. 221","ktoth@llbcompany.com","Stephanie"]
[13377,"LIVELY EXPLORATION CO","Cindy Forgey","713-840-1905","cforgey@livelyexp.com","Stephanie"]
[13645,"LYNX PETROLEUM CONSULTANTS INC","Debbie McKelvey","575-392-3575","debmckelvey@earthlink.net","Stephanie"]
[13837,"MACK ENERGY CORP","Tara Holmes","(432) 682-8844","taraholmes@mec.com","Klarisa"]
[14021,"MARATHON OIL CO","Roger Rangel","713-296-4172","rrangel1@marathonoil.com","Mallory"]
[14187,"MARSHALL & WINSTON INC","Sherry Roberts","432-684-6373","sroberts@mar-win.com","Estevan A"]
[14424,"MCKAY OIL CORP","Aggie Alexiev","575-492-1236","aggie@penrocoil.com","Stephanie"]
[14462,"ME-TEX OIL & GAS INC","LeAnn Whitehead","(575) 397-7750","lwhitehead@metexoil.com","Estevan A"]
[14634,"MERRION OIL & GAS CORP","Kevin Wilcox","(505) 486-4740","kwilcox@merrion.bz","Estevan A"]
[14744,"MEWBOURNE OIL CO","Stephanie Costlow","(903) 561-2900","scostlow@mewbourne.com","Mallory"]
[14771,"MGM OIL & GAS CO","Dionne Rogers","(405) 728-3003","d.rogers@marticons.com","Stephanie"]
[15363,"Murchison Oil and Gas, LLC","Lorgia Krull",4695736472,"lkrull@jdmii.com","Estevan A"]
[16513,"OMIMEX PETROLEUM INC","Katy Wilson","817-804-8934","katy_wilson@omimexgroup.com","Stephanie"]
[16696,"OXY USA INC","Joy Barnett","832-636-1224","Joy_Barnett@Oxy.com","Mallory"]
[17081,"PECOS RIVER OP INC","Tia Walker","575-519-4037","info@pecosriveroperating.com","Stephanie"]
[17213,"PENROC OIL CORP","Aggie Alexiev","575-492-1236","aggie@penrocoil.com","Estevan A"]
[17985,"PREMIER OIL & GAS INC","Rachel Clark","972-470-0228","rachel.clark@premieroilgas.com","Stephanie"]
[18099,"PRIME OPERATING CO","PrimeEnergy Helpdesk POC Helpdesk","713-735-0000","helpdesk@primeenergy.com","Stephanie"]
[18100,"PRIMERO OPERATING INC","Sheila Cornil","575-622-1001","sheila@primerooperating.com","Stephanie"]
[18917,"READ & STEVENS INC","Jennifer Turley","(575) 622-3770 x 306","jturley@read-stevens.com","Stephanie"]
[18973,"REDWOLF PRODUCTION INC","Dana Delventhal","505-326-4125","ddelventhal@centurylink.net","Stephanie"]
[19111,"RHOMBUS OPERATING CO LTD","Cindy Grogg","432-683-8873","rhombusenergy@gmail.com","Estevan A"]
[19237,"RIGGS OIL & GAS CORP","Terri Kennedy","928-460-5287","Officemanager@Riggsog.com","Stephanie"]
[19958,"STEPHENS & JOHNSON OP CO","Devire Crabb","940-716-5376","dcrabb@sjoc.net","Estevan A"]
[20305,"DEVON SFS OPERATING INC","Jeff Duke","(405) 228-8260","Jeff.Duke@dvn.com","Sammie"]
[20497,"SEELY OIL CO","Shellie Davis","817 332-1377","sdavis@seelyoil.com","Stephanie"]
[20572,"SG INTERESTS I LTD","Heather Huff","(713) 333-6506","asimpson@sginterests.com","Stephanie"]
[20595,"SHACKELFORD OIL CO","Debbie McKelvey","575-392-3575","debmckelvey@earthlink.net","Stephanie"]
[20989,"SMITH & MARRS INC","Joshua Olguin","(505) 688-7609","joshua@olguinps.com","Stephanie"]
[21013,"SNOW OIL & GAS INC","Sarah Anderson","432-524-2371 EXT 102","sarah@lotusllc.com","Stephanie"]
[21355,"SOUTHWEST ROYALTIES INC","Kathy Schwope","(432) 207-3051","kschwope@swrpermian.com","Klarisa"]
[21602,"TRILOGY OPERATING INC","Jeff Johnston","(830) 964-5963","jeffjohnston@stateoilreports.com","Stephanie"]
[21712,"STRATA PRODUCTION CO","Collin M Underation","575-622-1127 ext 20","cunderation@stratanm.com","Estevan A"]
[22044,"MCELVAIN ENERGY, INC","KANCHAN GHIMIRE","(303) 298-7262","kghimire@ondrishcpa.com","Stephanie"]
[22767,"EASTLAND OIL CO","Yesenia Rubio","(432) 683-6293","yrubio@eastlandoil.com","Stephanie"]
[23544,"TURNER PRODUCTION CO","Sherry Gibbs","214-361-7010","sggibbs945@aol.com","Stephanie"]
[23654,"OCEAN ENERGY INC","Jeff Duke","(405) 228-8260","Jeff.Duke@dvn.com","Stephanie"]
[24225,"W A MONCRIEF JR","Marla Davis","817-336-7232","mdavis@moncriefoil.com","Stephanie"]
[24231,"W B HAMILTON ESTATE","Nancy Walden","(505) 327-4892","nancy@walsheng.net","Stephanie"]
{"$rows_left_out":299}
{"sheet":"Reassigned","index":3,"n_rows":379,"n_cols":5,"rows_kept":379,"cut":false,"hidden":true,"merged":[]}
["OGRID","NAME ","ANALYST","Email ","Phone"]
[184,"ACOMA OIL CORP","Stephanie","sodell@nmslo.gov ",5058275878]
[778,"BP AMERICA PRODUCTION COMPANY","Stephanie","sodell@nmslo.gov ",5058275878]
[785,"AMTEX ENERGY INC                             ","Estevan A","eaarmijo@nmslo.gov",5054764582]
[873,"APACHE CORPORATION                           ","Klarisa","kchavez@nmslo.gov",5058275765]
[1092,"ARMSTRONG ENERGY CORP                        ","Estevan A","eaarmijo@nmslo.gov",5054764582]
[1801,"BEPCO, LP","Stephanie","sodell@nmslo.gov ",5058275878]
[1903,"BEACH EXPLORATION INC","Stephanie","sodell@nmslo.gov ",5058275878]
[2096,"BENSON-MONTIN-GREER DRILLING CORP","Stephanie","sodell@nmslo.gov ",5058275878]
[2175,"BETTIS BOYLE & STOVALL,INC.","Stephanie","sodell@nmslo.gov ",5058275878]
[2193,"BETWELL OIL & GAS CO","Stephanie","sodell@nmslo.gov ",5058275878]
[2799,"BRECK OPERATING CORP","Stephanie","sodell@nmslo.gov ",5058275878]
[2832,"BRIDWELL OIL CO","Stephanie","sodell@nmslo.gov ",5058275878]
[3002,"BTA OIL PRODUCERS","Sammie","srmarquez@nmslo.gov",5054764570]
[3044,"BURGUNDY OIL & GAS OF N M INC","Stephanie","sodell@nmslo.gov ",5058275878]
[4323,"CHEVRON U S A INC                            ","Mallory","mmiera@nmslo.gov",5058275787]
[4378,"CHI OPERATING INC                            ","Sammie","srmarquez@nmslo.gov",5054764570]
[4537,"CITATION OIL & GAS CORP                      ","Estevan A","eaarmijo@nmslo.gov",5054764582]
[5380,"XTO ENERGY, INC*                             ","Casandra","ccano@nmslo.gov",5058275701]
[5493,"CURTIS J LITTLE","Stephanie","sodell@nmslo.gov ",5058275878]
[5898,"DAVID H ARRINGTON OIL & GAS INC","Stephanie","sodell@nmslo.gov ",5058275878]
[6137,"DEVON ENERGY PRODUCTION COMPANY, LP          ","Sammie","srmarquez@nmslo.gov",5054764570]
[6224,"DINERO OPERATING CO","Stephanie","sodell@nmslo.gov ",5058275878]
[6515,"DUGAN PRODUCTION CORP                        ","Sammie","srmarquez@nmslo.gov",5054764570]
[6742,"ECHO PRODUCTION INC","Stephanie","sodell@nmslo.gov ",5058275878]
[7160,"ELLIOTT A RIGGS","Stephanie","sodell@nmslo.gov ",5058275878]
[7377,"EOG RESOURCES INC                            ","Sammie","srmarquez@nmslo.gov",5054764570]
[7802,"FEAGAN GATHERING CO","Stephanie","sodell@nmslo.gov ",5058275878]
[8359,"GP II ENERGY INC","Stephanie","sodell@nmslo.gov ",5058275878]
[9338,"GREAT WESTERN DRILLING CO","Stephanie","sodell@nmslo.gov ",5058275878]
[9667,"H K KEESEE AND C J KEESEE TRUST","Stephanie","sodell@nmslo.gov ",5058275878]
[9812,"HEC PETROLEUM, INC","Stephanie","sodell@nmslo.gov ",5058275878]
[9974,"HANSON OPERATING CO INC","Stephanie","sodell@nmslo.gov ",5058275878]
[10155,"HARVARD PETROLEUM COMPANY, LLC               ","Estevan A","eaarmijo@nmslo.gov",5054764582]
[10605,"HOLCOMB OIL & GAS INC","Stephanie","sodell@nmslo.gov ",5058275878]
[11095,"J & J SERVICE INC","Stephanie","sodell@nmslo.gov ",5058275878]
[12254,"JPH OIL PRODUCERS DBA JIMMY P HODGE","Stephanie","sodell@nmslo.gov ",5058275878]
[12361,"KAISER-FRANCIS OIL CO                        ","Sammie","srmarquez@nmslo.gov",5054764570]
[12444,"PROVIDENCE ENERGY SERVS INC.-KELTON OP CORP","Stephanie","sodell@nmslo.gov ",5058275878]
[12627,"KEVIN O BUTLER & ASSOC INC","Stephanie","sodell@nmslo.gov ",5058275878]
[13089,"LARIO OIL & GAS CO                           ","Estevan A","eaarmijo@nmslo.gov",5054764582]
[13343,"LINDENMUTH & ASSOCIATES INC","Stephanie","sodell@nmslo.gov ",5058275878]
[13377,"LIVELY EXPLORATION CO","Stephanie","sodell@nmslo.gov ",5058275878]
[13645,"LYNX PETROLEUM CONSULTANTS INC","Stephanie","sodell@nmslo.gov ",5058275878]
[13837,"MACK ENERGY CORP                             ","Klarisa","kchavez@nmslo.gov",5058275765]
[14021,"MARATHON OIL CO","Mallory","mmiera@nmslo.gov",5058275787]
[14187,"MARSHALL & WINSTON INC                       ","Estevan A","eaarmijo@nmslo.gov",5054764582]
[14424,"MCKAY OIL CORP","Stephanie","sodell@nmslo.gov ",5058275878]
[14462,"ME-TEX OIL & GAS INC                         ","Estevan A","eaarmijo@nmslo.gov",5054764582]
[14634,"MERRION OIL & GAS CORP                       ","Estevan A","eaarmijo@nmslo.gov",5054764582]
[14744,"MEWBOURNE OIL CO                             ","Mallory","mmiera@nmslo.gov",5058275787]
[14771,"MGM OIL & GAS CO","Stephanie","sodell@nmslo.gov ",5058275878]
[15363,"Murchison Oil and Gas, LLC                   ","Estevan A","eaarmijo@nmslo.gov",5054764582]
[16513,"OMIMEX PETROLEUM INC","Stephanie","sodell@nmslo.gov ",5058275878]
[16696,"OXY USA INC                                  ","Mallory","mmiera@nmslo.gov",5058275787]
[17081,"PECOS RIVER OP INC","Stephanie","sodell@nmslo.gov ",5058275878]
[17213,"PENROC OIL CORP                              ","Estevan A","eaarmijo@nmslo.gov",5054764582]
[17985,"PREMIER OIL & GAS INC","Stephanie","sodell@nmslo.gov ",5058275878]
[18099,"PRIME OPERATING CO","Stephanie","sodell@nmslo.gov ",5058275878]
[18100,"PRIMERO OPERATING INC","Stephanie","sodell@nmslo.gov ",5058275878]
[18917,"READ & STEVENS INC","Stephanie","sodell@nmslo.gov ",5058275878]
[18973,"REDWOLF PRODUCTION INC","Stephanie","sodell@nmslo.gov ",5058275878]
[19111,"RHOMBUS OPERATING CO LTD                     ","Estevan A","eaarmijo@nmslo.gov",5054764582]
[19237,"RIGGS OIL & GAS CORP","Stephanie","sodell@nmslo.gov ",5058275878]
[19958,"STEPHENS & JOHNSON OP CO                     ","Estevan A","eaarmijo@nmslo.gov",5054764582]
[20305,"DEVON SFS OPERATING INC","Sammie","srmarquez@nmslo.gov",5054764570]
[20497,"SEELY OIL CO","Stephanie","sodell@nmslo.gov ",5058275878]
[20572,"SG INTERESTS I LTD","Stephanie","sodell@nmslo.gov ",5058275878]
[20595,"SHACKELFORD OIL CO","Stephanie","sodell@nmslo.gov ",5058275878]
[20989,"SMITH & MARRS INC","Stephanie","sodell@nmslo.gov ",5058275878]
[21013,"SNOW OIL & GAS INC","Stephanie","sodell@nmslo.gov ",5058275878]
[21355,"SOUTHWEST ROYALTIES INC                      ","Klarisa","kchavez@nmslo.gov",5058275765]
[21602,"TRILOGY OPERATING INC","Stephanie","sodell@nmslo.gov ",5058275878]
[21712,"STRATA PRODUCTION CO                         ","Estevan A","eaarmijo@nmslo.gov",5054764582]
[22044,"MCELVAIN ENERGY, INC","Stephanie","sodell@nmslo.gov ",5058275878]
[22767,"EASTLAND OIL CO","Stephanie","sodell@nmslo.gov ",5058275878]
[23544,"TURNER PRODUCTION CO","Stephanie","sodell@nmslo.gov ",5058275878]
[23654,"OCEAN ENERGY INC","Stephanie","sodell@nmslo.gov ",5058275878]
[24225,"W A MONCRIEF JR","Stephanie","sodell@nmslo.gov ",5058275878]
[24231,"W B HAMILTON ESTATE","Stephanie","sodell@nmslo.gov ",5058275878]
{"$rows_left_out":299}